Clang Error Linker Command Failed With Exit Code 1 Matlab

XCode: linker command failed with exit code 1 (use -v to see invocation) xcode

RECOMMENDED: If you have Windows errors then we strongly recommend that you download and run this (Windows) Repair Tool.

In function `_start’: /usr/src/lib/csu/amd64/crt1.c:(.text+0x16b): undefined reference to `main’ clang: error: linker command failed with exit code 1 (use -v to see invocation) *** Error code 1 Thought it might be missing something.

_NativeDictionaryStorage<A, B> in ViewController.o ld: symbol(s) not found for architecture i386 clang: error: linker command failed with exit code 1 (use -v to see invocation) Ld.

I got lots of trouble to call c function from matlab. symbol(s) not found for architecture x86_64 clang: error: linker command failed with exit code 1.

However when connecting to an actual iOS device, I get the above error. Here are some of the details: ld:’/Users/***/Downloads/QuantumScalar/QuantumScalar/Plugins/com.adobe.plugins.GAPlugin/libGoogleAnalyticsServices.a(TAGDataProvider.o)’.

I’m trying to compile my program and it returns this error : usr/bin/ld: cannot find -l<nameOfTheLibrary> in my makefile I use the command g++ and link to my.

Hello I was building a timer app and when I compile I got this error: clang error: Linker command failed with exit code 1 And here are the links.

Scintilla and SciTE – History of Scintilla and SciTE Contributors Thanks to all the people that have contributed patches, bug reports and suggestions. Source code and.

Xcode 5 : link fails – clang – MATLAB Answers – MATLAB Central – Xcode 5 : link fails – clang. Users/boyer/Documents/MATLAB/fftw-3.3. architecture x86_64 clang: error: linker command failed with exit code 1.

Users/ash/Dropbox/500px/500px-ios/500px/ExternalLibraries/Google Analytics SDK/Library/libGoogleAnalytics.a for architecture armv7s clang: error: linker command failed with exit code 1 (use -v to see invocation) This is due to.

Sql Error Codes For Adaptive Server Enterprise Found When BizTalk Server and SQL Server. see the following error logged in the Event Viewer. Failed to load Program FilesCommon FilesEnterprise Single Sign-OnSSOPSServer.dll Error code: 0x8007007E, The specified module. SQL Server, Microsoft®’s enterprise-level relational. be familiar with this common error that occurs when connecting from WebSphere Application Server to SQL Server 2008: DSRA0010E: SQL State

error while using mexOpenCV – I installed the Opencv support package on MATLAB R2015a. I could compile the example. not found for architecture x86_64 clang: error: linker command failed with exit code 1 (use -v to see invocation) using namespace cv; using.

Matlab & Xcode 5 : "clang:. not found for architecture x86_64 clang: error: linker command failed with exit code 1. matlab mex clang C++11 thread -> Undefined.

Sep 24, 2014. Mex Link Failure: Undefined Symbols for Architecture. x86_64 clang: error: linker command failed with exit code 1 (use -v to see invocation)

error: linker command failed with exit code 1 (use -v to see invocation) Ld /Users/infinite/Library/Developer/Xcode/DerivedData/Interact-AR.

Error using mex Undefined symbols for architecture x86_64: clang: error: linker command failed with exit code 1. run the follwoing cmd in matlab and get the detailed error as below: mex -v simple_discrete_normal_call.cpp.

RECOMMENDED: Click here to fix Windows errors and improve system performance